search for: exe

Displaying 20 results from an estimated 10083 matches for "exe".

2013 Jan 30
3
bug report: apcsmart (WIN) 940-0024C connect fail, problem with command 'E'
...tect an APC Smart protocol UPS on port COM1 check the cabling, port name or model name and try again 16.944365 w32_serial_read : ulen 512, vmin_ -1, vtime_ 0, hEvent 000007CC 19.968713 w32_serial_read : timeout 3000 ms ellapsed corresponding portmon capture log: 0 0.00000000 apcsmart.exe IRP_MJ_CREATE Serial0 Options: Open 0 0.00008269 SUCCESS 1 0.00000000 apcsmart.exe IOCTL_SERIAL_SET_WAIT_MASK Serial0 Mask: RXCHAR 1 0.00001285 SUCCESS 2 0.00000000 apcsmart.exe IOCTL_SERIAL_SET_TIMEOUTS Serial0 RI:0 RM:0 RC:0 WM:0 WC:0 2 0.00000531 SUCCESS 3 0.00000000 apcsmar...
2011 Aug 11
2
[LLVMdev] LLVM 2.9 64bits on Visual Studio 9
...LLVM with CMAKE generator "Visual Studio 9 2008 Win64" (OS Windows 7). -But when I run the Fibonacci example program in "release" mode, I get a crash with this visual studio popup message : Microsoft Visual Studio C Runtime Library has detected a fatal error in Fibonacci.exe. -Here is the visual studio output: 'Fibonacci.exe': Loaded 'C:\Users\IUC\Desktop\BUILD_64\bin\Release\Fibonacci.exe', Binary was not built with debug information. 'Fibonacci.exe': Loaded 'C:\Windows\System32\ntdll.dll' 'Fibonacci.exe': Loaded 'C:\Wi...
2020 Aug 20
5
Clang is a resource hog, the installers for Windows miss quite some files, and are defect!
Hi @ll, BUGS #1 & #2: ~~~~~~~~~~~~~ The installer LLVM-10.0.0-win64.exe dumps the following DUPLICATE files in "C:\Program Files\LLVM\bin", WASTING about 500MB disk space, which is nearly a third of the disk space occupied by the whole package: | DIR "C:\Program Files\LLVM\bin" /O:-S ... | 25.03.2020 12:15 83.258.880 clang-...
2008 Feb 13
1
Flash Movie Player Control in VB
...;ryan/.wine/dosdevices/c:/Program Files/TimeMAPS" trace:file:RtlSetCurrentDirectory_U curdir now L"C:\\Program Files\\TimeMAPS\\" 0x10 trace:file:RtlDosPathNameToNtPathName_U (L"/home/ryan/.wine/drive_c/Program Files/TimeMAPS/TMMLS.exe",0xbfff0f88,(nil),(nil)) trace:file:RtlGetFullPathName_U (L"/home/ryan/.wine/drive_c/Program Files/TimeMAPS/TMMLS.exe" 520 0xbfff0d40 (nil)) trace:file:find_drive_rootW L"/home/ryan/.wine/drive_c/Program Files/TimeMAPS/TMML...
2011 Apr 26
3
Registering Dll in system32 Failed anyone help me?
H:\>regsvr32.exe C:\WINDOWS\SYSTEM32\oeinpr3.dll DllRegisterServer not implemented in DLL C:\WINDOWS\SYSTEM32\oeinpr3.dll H:\>regsvr32.exe C:\WINDOWS\SYSTEM32\oeinsmd.dll DllRegisterServer not implemented in DLL C:\WINDOWS\SYSTEM32\oeinsmd.dll H:\>regsvr32.exe C:\WINDOWS\SYSTEM32\oeintck.dll DllRegisterServ...
2020 Aug 23
3
Apropos "shouting": PLEASE ATTACH THE FOLLOWING FILES TO THE BUG REPORT
...ix\n" "\tmov\trax, dummy\n" "\tret\n"); } --- EOF --- --- crash-74a40f.sh --- # Crash reproducer for clang version 10.0.0 # Driver args: "-c" "-m64" "crash.c" # Original command: "C:\\Program Files\\LLVM\\bin\\clang.exe" "-cc1" "-triple" "x86_64-pc-windows-msvc19.11.0" "-emit-obj" "-mrelax-all" "-mincremental-linker- compatible" "-disable-free" "-disable-llvm-verifier" "-discard-value-names" "-ma in-file-name"...
2008 Jul 21
4
help to install poser 7
...tallation is fine , when i run it ., the screen is deform only can restart but i have a impr paint http://img147.imageshack.us/img147/2600/pantallazo2cb1.png , why deform my screen and the impr paint it's fine ? , well apply gatito at gatito:~$ WINEDEBUG=warn+all wine poser.exe for debug and this is my lines : gatito at gatito:~$ WINEDEBUG=warn+all wine poser.exe warn:ntdll:NtCreateFile L"\\??\\C:\\windows" not found (c0000035) warn:ntdll:NtCreateFile L"\\??\\C:\\windows\\system32" not found (c0000035) warn:file:wine_nt_to_unix_file_name L"poser.e...
2011 Apr 25
11
i having a problem in application... anyone help me?
when i click Sales History in Accpac Advantage Series... i saw the process in wine task manager Rlzrun30.rts and theres nothing happen or wont appear what does rts supported?
2014 Jan 14
2
Unable to detect an APC Smart protocol UPS. Windows. APC Smart protocol driver 3.04 (2.6.5-3723:3731M)
...han what were set unable to detect an APC Smart protocol UPS on port com1 check the cabling, port name or model name and try again ups.conf: [ups] driver=apcsmart port=com1 cable=940-0095B desc="test" Sysinternals Portmon captures the following activity on com1: 0.00009862 apcsmart.exe IRP_MJ_WRITE Serial0 SUCCESS Length 1: 59 Y 0.00001090 apcsmart.exe IRP_MJ_READ Serial0 SUCCESS Length 1: 53 S 0.00000950 apcsmart.exe IRP_MJ_READ Serial0 SUCCESS Length 3: 4D 0D 0A M [CR] [LF] 1.48775808 apcsmart.exe IRP_MJ_READ Seri...
2015 Feb 20
2
[LLVMdev] Building Compiler-RT on Windows
Has anyone built Compiler-RT on Windows? I am attempting to compile it for ARM, but I get errors from CMake. It appears to be trying to pass VC++ flags to Clang. I am using a version of Clang built from trunk. PS D:\llvm\arm_test\compiler-rt-build> cmake -G Ninja -DCMAKE_C_COMPILER=clang.exe -DCMAKE_CXX_COMPILER=clang++.exe -DCM AKE_RC_COMPILER=rc.exe -DCMAKE_CXX_FLAGS="" -DCMAKE_C_FLAGS="" ..\compiler-rt -- The C compiler identification is Clang 3.7.0 clang.exe: error: no such file or directory: '/nologo' clang.exe: error: no such file or directory: ...
2010 Jan 06
1
Re: Lingoes 2
dimesio wrote: > > durammx wrote: > > Hi all! > > I trying to run this program (http://appdb.winehq.org/objectManager.php?sClass=version&iId=17469) but I'm a really noob on wine. :? > > Can a big master of wine test? > > > > Also posted a bug (http://bugs.winehq.org/show_bug.cgi?id=19678) on bugzilla. > > > > Hope
2015 Feb 20
3
[LLVMdev] Building Compiler-RT on Windows
[+Saleem] On Fri Feb 20 2015 at 10:31:04 PM Daniel Dilts <diltsman at gmail.com> wrote: > I am using CMake 3.1.2. > > On Fri, Feb 20, 2015 at 10:00 AM, Alexey Samsonov <vonosmas at gmail.com> > wrote: > >> It looks like your command fails early in CMake TryCompile tests. Does >> (your version of) CMake supports using Clang on Windows at all? >> >> On Fri, Feb 20, 2015 at 7:02 AM, Daniel Dilts <diltsman at gmail.com...
2015 Feb 27
1
[LLVMdev] clang\clang++ 3.6.0 don't find C\C++ header , in windows ?
1 hour ago I downloaded llvm-3.6.0-rc4-win32.exe from http://llvm.org/pre-releases/3.6.0/ . I tried to compile simple C code that just print "hello" , but it didn't compile , because clang.exe can't find . when I use clang-cl.exe with the same code , it worked . I also have the same problem with clang++ eve...
2007 Jan 09
6
"Module not found", using wine-0.9.28
...s message in the list archive, but none which really match my scenario. i'm running 0.9.28 on ubuntu edgy. of course, i'm new at wine -- so this could be user error. i'm trying to install TaxCut 2006, from the CDROM: $ ls .wine/dosdevices/d\:/ autorun.inf* df0000exe.manifest* taxcut.exe* temporaryitems/ data/ dpro2006.exe* taxcutapp/ df0000.exe* taxcut/ taxcutexe.manifest* $ $ WINEDEBUG=warn+all wine .wine/dosdevices/d\:/taxcut.exe warn:module:load_builtin_dll cannot open...
2011 Oct 02
1
World of WarCraft: Retail Build (build 14545)
I am trying to play with wine but when i try to start the game nothing hapens and when i try to execute wow.exe i get this error : Code: World of WarCraft: Retail Build (build 14545) Exe: C:\Arquivos de programas\World of Warcraft\Wow.exe Time: Oct 1, 2011 7:27:05.841 PM User: shalimar Computer: shalimar-deskto --------------------------------------------------------------------...
2013 Feb 12
1
[SC] EnumQueryServicesStatus:OpenService FAILED 123
...using an "unless" we can avoid it. * *Sound very simple, but for any reason, when instructions are called by puppet they are not working instead you call directly, same instructions, using DOS, where works sweet.* * * *Here is part of the code:* $cmd = "C:\\Windows\\System32\\cmd.exe" $scPath = "C:\\Windows\\System32\\sc.exe" $findPath = "C:\\Windows\\System32\\find.exe" # Create Service exec{''Create Service nsc-devops'': command => "${cmd} /c \"${scPath} create nsc-devops binPath= \"C:\\NSClient++\\nsclie...
2011 Aug 15
0
[LLVMdev] LLVM 2.9 64bits on Visual Studio 9
FYI, I have confirmed it works on VS10SP1 with x64|Release. E:\llvm\build\cmake-x64-vs10>bin\Release\Fibonacci.exe 24 verifying... OK We just constructed this LLVM module: --------- ; ModuleID = 'test' (snip) --------- starting fibonacci(24) with JIT... Result: 46368 ...Takumi 2011/8/11 <gleizesd at gmail.com>: > Hello everybody, > > I have sucessfully compiled LLVM with CMAK...
2008 Apr 11
4
Can't run Active State perl .exe
I am having trouble running an exe that was written in Active State perl. In Windows, I would go to the CLI and type Code: C:\pager\pager.exe cl Passing "cl" as an arguement that passes the file "cl.config" to the pager.exe program. I have not had any success running this in Wine, and I do not know if it is...
2011 Jun 25
6
Ubuntu 11.04: World of Warcraft issue
....org/showpost.php?p=7643957&postcount=82]here[url] now whenever World of Warcraft would try to render a character, it crashes and spews the following error: > ============================================================================== > World of WarCraft (build 12340) > > Exe: C:\Program Files\World of Warcraft\WoW.exe > Time: Jun 24, 2011 8:40:39.106 PM > User: cody > Computer: geek > ------------------------------------------------------------------------------ > > This application has encountered a critical error: > > ERROR #13...
2020 Aug 23
2
Apropos "shouting": PLEASE ATTACH THE FOLLOWING FILES TO THE BUG REPORT
..."\tret\n"); >> } >> --- EOF --- >> >> --- crash-74a40f.sh --- >> # Crash reproducer for clang version 10.0.0 >> # Driver args: "-c" "-m64" "crash.c" >> # Original command: "C:\\Program Files\\LLVM\\bin\\clang.exe" "-cc1" >> "-triple" >> "x86_64-pc-windows-msvc19.11.0" "-emit-obj" "-mrelax-all" >> "-mincremental-linker- >> compatible" "-disable-free" "-disable-llvm-verifier" >> "-discard-va...