similar to: Patching asterisk for spandsp

Displaying 20 results from an estimated 5000 matches similar to: "Patching asterisk for spandsp"

2005 Jan 07
5
fax e-mail spandsp
I'm trying to install spandsp But when I try to patch the Makefile it gives this error [root@pbxmilkshake apps]# patch < apps_makefile.patch patching file Makefile Reversed (or previously applied) patch detected! Assume -R? [n] y Hunk #1 succeeded at 41 (offset -6 lines). Hunk #2 FAILED at 67. is it ok to go on
2004 Jun 21
1
Problem compiling fax applications
I'm tring to compile fax applications on Debian system. the spandsp library compiles ok, and when i try to patch the make file in apps directory as is said in the instructions it returns errors. I'm using cvs version of asterisk . -------------------------- voipgw:/usr/src/asterisk/apps# patch < Makefile.patch patching file Makefile Hunk #1 FAILED at 35. Hunk #2 FAILED at 68. 2 out of
2004 Aug 18
27
SpanDSP
Anyone knows where can I find spandsp? Official site seems permanently down... TIA, Simone.
2004 Sep 26
1
spandsp patch help
I've installed spandsp-0.0.1k on a RHv9 box with CVS-HEAD-09/19/04 and compiled the libraries just fine. Having a problem with patching the asterisk/apps Makefile however. The patch attempt results in: [root@phoenix apps]# patch <Makefile.patch patching file Makefile Hunk #1 FAILED at 35. Hunk #2 FAILED at 68. 2 out of 2 hunks FAILED -- saving rejects to file Makefile.rej [root@phoenix
2005 Mar 28
1
Problem installing SpanDSP Makefile.patch
*************** *** 41,50 **** APPS+=$(shell if [ -f /usr/include/linux/zaptel.h ]; then echo "app_zapras.so app_meetme.so app_flash.so a pp_zapbarge.so app_zapscan.so" ; fi) APPS+=$(shell if [ -f /usr/local/include/zaptel.h ]; then echo "app_zapras.so app_meetme.so app_flash.so a pp_zapbarge.so app_zapscan.so" ; fi) APPS+=$(shell if [ -f /usr/include/osp/osp.h ]; then
2004 May 25
10
spandsp hylafax asterisk and confusion
I have been attempting to download, compile and configure spandsp to function with * without much luck. I am guessing that some assumptions were made regarding the users knowledge level of Linux. Sadly, I must not live up to those assumptions. My problem begins when after compiling spandsp I look for the app_rxfax.c, app_txfax.c, app_dtmftotext.c and makefile.patch files to place in the
2005 Sep 14
11
RxFax/TxFax - Compile Problem
Anyone know how to fix this? gcc -shared -Xlinker -x -o app_rxfax.so app_rxfax.c -lspandsp -ltiff In file included from app_rxfax.c:14: /usr/include/asterisk/lock.h: In function `ast_mutex_init': /usr/include/asterisk/lock.h:302: error: `PTHREAD_MUTEX_RECURSIVE' undeclared (first use in this function) /usr/include/asterisk/lock.h:302: error: (Each undeclared identifier is reported
2004 May 28
2
spandsp wont compile.
I can't get spandsp to compile. when I go to the */apps directory i continually fails. Makefile:80: warning: overriding commands for target `app_rxfax.so' Makefile:77: warning: ignoring old commands for target `app_rxfax.so' cc -fPIC -c -o app_rxfax.o app_rxfax.c app_rxfax.c:45: error: `PTHREAD_RECURSIVE_MUTEX_INITIALIZER_NP' undeclared here (not in a function) make: ***
2006 Jan 22
6
spandsp Error
I cannot see it!!!! make[1]: Leaving directory `/usr/local/src/svn-versions/asterisk/pbx' /bin/sh: curl-config: command not found make[1]: Entering directory `/usr/local/src/svn-versions/asterisk/apps' Makefile:103: *** missing separator. Stop. make[1]: Leaving directory `/usr/local/src/svn-versions/asterisk/apps' make: *** [depend] Error 1 Makefile: 93 install: all 94
2004 Aug 12
1
Problem installing Software Fax SpanDSP support into Asterisk
I'm trying to install the SPANDSP software into Asterisk to support incoming (mainly) Fax. I'm following the info in http://www.voip-info.org/wiki-Asterisk+Fax. I downloaded and installed the spandsp software from ftp://ftp.opencall.org/pub/spandsp/ and followed the directions in several documents listed on the on the Tiki page. I get down to patch < Makefile.patch that fails with
2004 Nov 23
4
Spandsp and Asterisk
Does anyone have an update patch file to get Spandsp installed? I'm running asterisk CVS-HEAD-11/19/04-21:53:37 on redhat 9.0 I installed spandsp-0.0.2 when runnig the patch I get patching file Makefile Hunk #1 FAILED at 41. Hunk #2 FAILED at 69. 2 out of 2 hunks FAILED -- saving rejects to file Makefile.rej -------------- next part -------------- An HTML attachment was scrubbed...
2006 Jan 13
0
R: RE: RE: Spandsp
Patch it by hand. Follow this help http://www.asteriskguru.com/tutorials/spandsp.html Hi Giordano -----Messaggio originale----- Da: asterisk-users-bounces@lists.digium.com [mailto:asterisk-users-bounces@lists.digium.com] Per conto di Tomislav Parcina Inviato: venerd? 13 gennaio 2006 12.28 A: asterisk-users@lists.digium.com Oggetto: [Asterisk-Users] RE: RE: Spandsp In article
2006 Jan 08
0
spandsp for 1.2.1 - libspandsp.so.0: cannot open shared object file: No such file or directory
I am getting the following error when starting: loader.c:325 __load_resource: libspandsp.so.0: cannot open shared object file: No such file or directory loader.c:499 load_modules: Loading module app_txfax.so failed! When I load app_txfax.so and/or app_txfax.so; if these are commented out, asterisk starts fine. I downloaded the spandsp version from
2006 Jan 08
0
spandsp for 1.2.1 - libspandsp.so.0: cannot openshared object file: No such file or directory
Make sure that /usr/local/lib is in your lib path. /etc/ld.conf ________________________________ From: asterisk-users-bounces@lists.digium.com [mailto:asterisk-users-bounces@lists.digium.com] On Behalf Of David C. Nicosia Sent: Sunday, January 08, 2006 5:25 PM To: asterisk-users@lists.digium.com Subject: [Asterisk-Users] spandsp for 1.2.1 - libspandsp.so.0: cannot openshared object file:
2008 Jan 08
3
app_rxfax.c and app_txxfax.c where?
Hi All, Where can I find copies of the app_rxfax.c, app_txfax.c and apps_Makefile.patch. They don't seem to be located at soft-switch.org anymore. I am currently trying to compile Asterisk 1.2.26.1 and need the fax components. Thanks. -------------- next part -------------- An HTML attachment was scrubbed... URL:
2005 Aug 08
1
Setup faxing with latest CVS/STABLE
I have been trying to get faxing working with stable but I have had no luck since cvs 1.0.4. I've tried 3 versions of SpanDSP and the system answers the fax but looks like it isn't training properly. Lee -----Original Message----- From: asterisk-users-bounces@lists.digium.com [mailto:asterisk-users-bounces@lists.digium.com] On Behalf Of Bob Goddard Sent: 06 August 2005 23:44 To:
2005 Aug 06
1
Setup faxing with latest CVS
I have been trying to setup faxing with a recent CVS-HEAD. I have downloaded and compiled spandsp-0.0.2pre18 and gotten apps_makefile.patch, app_txfax.c and app_rxfax.c I'm not suprised that the patch failed. Does anyone know what changes need to be made for this to work? I have very little Fedora experience and no experience in changing make files so this is all new to me. Thanks,
2007 Aug 07
6
Which spandsp & unicall version to use with 1.2?
Hi all, Anyone have an idea which version of spandsp, libunicall, libmfcr2, libsupertone, app_rxfax/app_txfax and chan_unicall I should use for the latest asterisk 1.2? Would that be the ones listed below? http://www.soft-switch.org/downloads/spandsp/spandsp-0.0.4pre4.tgz http://www.soft-switch.org/downloads/snapshots/spandsp/test-apps-asterisk-1.2/
2006 Jan 12
6
app_rxfax.so and app_txfax.so
Hi, I just installed spandsp 0.0.3pre6 with libtiff 3.7.1 and evrythinghs is ok. I recompiled asterisk and run ldocnfig, but whrn I start asterisk I get this error: [app_rxfax.so]Jan 12 16:40:42 WARNING[1569]: loader.c:258 ast_load_resource: /usr/lib/asterisk/modules/app_rxfax.so: undefined symbol: fax_set_phase_d_handler Jan 12 16:40:42 WARNING[1569]: loader.c:440 load_modules: Loading
2009 Jul 20
2
What am I doing wrong?
Hi Gang, I've got the latest SVN branch of 1.4 downloaded onto SUSE 11.0. Everything is happy EXCEPT, I can't get fax to be recognized by make menuselect. I tried copying app_rxfax.c and app_txfax.c to the apps directory and starting again from ./configure, but no joy. Any suggestions? Danny Nicholas -------------- next part -------------- An HTML attachment was