Displaying 3 results from an estimated 3 matches for "rpackagebuild".
Did you mean:
r_packagebuild
2008 Jun 23
1
Problem when building a test R package on PC
I followed the instruction of building R package on PC by Peter Rossi. I got
problem when I tried to build a R package from his example, test.zip. The
problem occurs when I tried to
R CMD check test
the screen stops at
D:\Rpackagebuild\Rossi_test>R CMD check test
* checking for working pdflatex ... OK
* using log directory 'D:/Rpackagebuild/Rossi_test/test.Rcheck'
* using R version 2.7.0 (2008-04-22)
* using session charset: ISO8859-1
* checking for file 'test/DESCRIPTION' ... OK
* this is package 'test'...
2013 Oct 22
1
possible Sweave problem in rdevel build on Debian 6.0.8?
...ository, Revision:
64090:
./configure && make -j4 distclean && ./configure && make -j4
[lots of normal compile output not shown...]
building/updating vignettes for package 'utils' ...
processing 'Sweave.Rnw'
Error: running Sweave on vignette
'/net/home/rpackagebuilder/src/R.trunk/src/library/utils/vignettes/Sweave.Rnw'
failed with message:
<text>:1:1: unexpected '|'
1: |
^
Execution halted
make[1]: *** [vignettes-lattice] Error 1
make[1]: Leaving directory
`/net/home/rpackagebuilder/src/R.trunk/src/library'
make: *** [vignettes] E...
2013 Oct 22
1
possible Sweave problem in rdevel build on Debian 6.0.8?
...n:64096:
We are running:
./configure && make -j4 distclean && ./configure && make -j4
[lots of normal compile output not shown...]
building/updating vignettes for package 'utils' ...
processing 'Sweave.Rnw'
Error: running Sweave on vignette
'/net/home/rpackagebuilder/src/R.trunk/src/library/utils/vignettes/Sweave.Rnw'
failed with message:
<text>:1:1: unexpected '|'
1: |
^
Execution halted
make[1]: *** [vignettes-lattice] Error 1
make[1]: Leaving directory
`/net/home/rpackagebuilder/src/R.trunk/src/library'
make: *** [vignettes]...