search for: c1083

Displaying 20 results from an estimated 45 matches for "c1083".

Did you mean: 1083
2011 Apr 22
2
Can't compile libtheora vs2010
I'm getting errors like so on initial build of libtheora - 1>c1 : fatal error C1083: Cannot open source file: '..\lib\dec\x86_vc\x86stat.c': No such file or directory 1> mmxstate.c (TaskId:16) 1>c1 : fatal error C1083: Cannot open source file: '..\lib\dec\x86_vc\mmxstate.c': No such file or directory 1> mmxloopfilter.c (TaskId:16) 1>c1 : fatal error...
2014 Jun 04
2
opus_multistream_encode_float not working in libopus 1.1
> Have you tried compiling it yourself? I just installed git for the first time and downloaded all of the latest source code packages directly from the site. I'm getting the following every time I try to (re)build any of the projects: 1>------ Build started: Project: opus, Configuration: Release Win32 ------ 1> fatal: Not a git repository: 'C:\My
2014 Jun 04
3
opus_multistream_encode_float not working in libopus 1.1
...error MSB3073: :VCEnd" exited with code 1. 5>------ Build started: Project: silk_fixed, Configuration: Release Win32 ------ 6>------ Build started: Project: test_opus_api, Configuration: Release Win32 ------ 6> test_opus_api.c 6>C:\My Documents\Opus\win32\config.h(43): fatal error C1083: Cannot open include file: 'version.h': No such file or directory 5> apply_sine_window_FIX.c 5>C:\My Documents\Opus\win32\config.h(43): fatal error C1083: Cannot open include file: 'version.h': No such file or directory 5> autocorr_FIX.c 5>C:\My Documents\Opus\win32\co...
2008 Sep 21
3
[LLVMdev] Has anyone sucessfully compile the llvm code using visual
...CodeGen, Configuration: Debug Win32 ------ 3>------ Build started: Project: Transforms, Configuration: Debug Win32 ------ 2>Compiling... 3>Compiling... 2>GCStrategy.cpp 3>RSProfiling.cpp 3>c:\Documents and Settings\Administrator\llvm\include\llvm/Intrinsics.h(39) : fatal error C1083: Cannot open include file: 'llvm/Intrinsics.gen': No such file or directory 3>DeadArgumentElimination.cpp 2>c:\Documents and Settings\Administrator\llvm\include\llvm/Intrinsics.h(39) : fatal error C1083: Cannot open include file: 'llvm/Intrinsics.gen': No such file...
2009 Jan 07
2
\iaxclient-2.0.2 compile problem
Hi, I had downlaoded iaxclient-2.0.2 and complie project *\iaxclient-2.0.2\contrib\win\vs2005* ** It gives many83 fatal and file missing error of file missing Error 1 fatal error C1083: Cannot open include file: 'portaudio.h': No such file or directory d:\mohit\asterisk\iaxclient-2.0.2\iaxclient-2.0.2\lib\portmixer\px_win_wmme\px_win_wmme.c 40 Error 2 fatal error C1083: Cannot open source file: '..\..\..\..\libtheora\lib\toplevel.c': No such file or directory c1 E...
2007 Nov 28
1
Problem compiling SVN-HEAD
Hi guys, Quick question - I'm getting errors compiling the tests; of the form: .\apitest.cc(46) : fatal error C1083: Cannot open include file: 'api_anydb.h': No such file or directory api_anydb.cc .\api_anydb.cc(26) : fatal error C1083: Cannot open include file: 'api_anydb.h': No such file or directory These files don't seem to exist. Any hints? Cheers Charlie
2009 Oct 28
3
[LLVMdev] windows build
Hi I am running into bunch of windows build issues. Can someone please provide help on what might be going wrong llvm\win32\Configure\..\llvm\ADT\hash_set.h 1>The system cannot find the file specified. Similarly 2>c1xx : fatal error C1083: Cannot open source file: '..\..\lib\Support\Annotation.cpp': No such file or directory thanks in advance shrey
2013 Jul 22
4
[LLVMdev] Build Clang and LLVM on Win 8
...ual studio projects. Based on the web guide, it should be successful. First question, is it really? Then, I open visual studio and run the solution compilation. But, after a long time, I got a lot of errors stating that it is not possible to find the stdbool.h file + a few others. Example: error C1083: Impossibile aprire il file inclusione 'stdbool.h': No such file or directory (<my path>\llvm\projects\compiler-rt\lib\floatuntisf.c) <my path>\llvm\projects\compiler-rt\lib\int_lib.h 37 1 clang_rt.x86_64 error C2061: errore di sintassi: identificatore '__attribute__'...
2006 Nov 02
0
[LLVMdev] Problem Building LLVM with Visual Studio
2012 Apr 11
3
Ogg Theora files player
...8 on Windows XP. I built and added to the project libogg-1.3.0, libtheora-1.1.1, libvorbis-1.3.2 (http://www.xiph.org/downloads/) and SDL-1.2.15 (http://www.libsdl.org/release/SDL-devel-1.2.15-VC.zip). When I compile player_example.c Visual Studio shows: fatal error C1083: Cannot open include file: 'unistd.h': No such file or directory fatal error C1083: Cannot open include file: 'sys/soundcard.h': No such file or directory fatal error C1083: Cannot open include file: 'sys/ioctl.h': No such file or directory I found out that these fi...
2004 Dec 21
3
[LLVMdev] VC++: Cannot open include file: 'windows.h': No such file or directory
..., I cannot find windows either... In previous llvm sources windows.h was found in: 'include/llvm/Config'. ------ Build started: Project: support, Configuration: Release Win32 ------ Compiling... randtable.c c:\projects\src\llvm-1\llvm\lib\Support\bzip2\bzlib.h(117) : fatal error C1083: Cannot open include file: 'windows.h': No such file or directory huffman.c ---------------- Henrik. ============================================================= Henrik Bach Open Source Developer e-mail: henrik_bach_llvm at hotmail.com ==================================================...
2013 Jul 23
0
[LLVMdev] Build Clang and LLVM on Win 8
...guide, it should be successful. > First question, is it really? > > Then, I open visual studio and run the solution compilation. > > But, after a long time, I got a lot of errors stating that it is not > possible to find the stdbool.h file + a few others. > Example: > error C1083: Impossibile aprire il file inclusione 'stdbool.h': No such > file or directory (<my > path>\llvm\projects\compiler-rt\lib\floatuntisf.c) <my > path>\llvm\projects\compiler-rt\lib\int_lib.h 37 1 clang_rt.x86_64 > error C2061: errore di sintassi: identific...
2004 Sep 15
2
[LLVMdev] HowToUseJIT.cpp - file: 'llvm/ADT/iterator': No such file or directory
Hi I'm trying to compile HowToUseJIT.cpp, but it seems that iterator definition is missing: --------------------Configuration: HowToUseJIT - Win32 Debug-------------------- Compiling... HowToUseJIT.cpp c:\sfu\usr\local\src\llvm\include\llvm\adt\ilist(41) : fatal error C1083: Cannot open include file: 'llvm/ADT/iterator': No such file or directory Error executing cl.exe. I've looked and searched for it in the LLVM source folders, but it doesn't seem to be present. Futhermore, I've got the latest cvs sources. Any suggestions? Henrik ---...
2006 Aug 12
5
Windows build?
I performed a get on the CVS WxRuby2; I have installed wxWidgets 2.6.3 and SWIG 1.3.29. Additionally I am running Visual Studio on Windows XP. When I run rake to compile I receive the following error. App.cpp c:\wxWidgets-2.6.3/include\wx/platform.h(190) : fatal error C1083: Cannot open include file: ''wx/setup.h'': No such file or directory rake aborted! Command failed with status (2): [cl.exe -c -Ic:\wxWidgets-2.6.3/include -D_...] I''m not sure why this is happening. I have looked at my environment variables and don''t see...
2020 Jun 12
2
Misc patches
...ok.com>; opus at xiph.org <opus at xiph.org> Subject: Re: [opus] Misc patches Speaking of needing more complete ci feedback, the intrin0.h patch broke the appveyor build: > Microsoft (R) Build Engine version 14.0.25420.1 > [...] > :\projects\opus\celt\ecintrin.h(53): fatal error C1083: Cannot open include file: 'intrin0.h': No such file or directory [C:\projects\opus\win32\VS2015\opus.vcxproj] https://nam10.safelinks.protection.outlook.com/?url=https%3A%2F%2Fci.appveyor.com%2Fproject%2Frillian%2Fopus%2Fbuilds%2F33474422&amp;data=02%7C01%7C%7C4162e7234344...
2009 Oct 28
0
[LLVMdev] windows build
...m> writes: > I am running into bunch of windows build issues. Can someone > please provide help on what might be going wrong > > > llvm\win32\Configure\..\llvm\ADT\hash_set.h > 1>The system cannot find the file specified. > > Similarly > 2>c1xx : fatal error C1083: Cannot open source file: > '..\..\lib\Support\Annotation.cpp': No such file or directory I guess you are using cmake with Visual Studio. Please report version of LLVM used (or svn revision number), version of Visual Studio, exact cmake command used, exact nmake invocation, exact error...
2005 May 14
0
Building OPENH.323 ERROR HELP PLEASE
...------ Configuring Build Options This program cannot be run in DOS mode. Error executing c:\winnt\system32\cmd.exe. asnparser.exe - 1 error(s), 0 warning(s) --------------------Configuration: GUI - Win32 Release-------------------- Compiling... pwlib.cxx ..\..\..\include\ptlib.h(138) : fatal error C1083: Cannot open include file: 'ptbuildopts.h': No such file or directory Error executing cl.exe. pwtest.exe - 1 error(s), 0 warning(s) --------------------Configuration: GUI - Win32 Debug-------------------- Compiling... pwlib.cxx ..\..\..\include\ptlib.h(138) : fatal error C1083: Cannot open...
2006 Aug 18
1
Compiling problem on Windows
Something recent has caused a change in the Windows compilation. I''m now getting: C:\RubyDev\wxWidgets-2.6.3/include\wx/platform.h(190) : fatal error C1083: Cannot open include file: ''wx/setup.h'': No such file or directory I didn''t get this before I pulled the latest files. I don''t see anything obvious that would have changed this and I''m certain I didn''t delete the setup.h file. I'...
2002 Jul 23
1
Problems running batch files in\libvorbis-1.0\win32
...ib paths for Vorbis Compiling... Deleting intermediate files and output files for project 'vorbisfile_dynamic - Win32 Release'. --------------------Configuration: vorbisfile_dynamic - Win32 Release-------------------- Compiling... vorbisfile.c ..\include\vorbis/codec.h(26) : fatal error C1083: Cannot open include file: 'ogg/ogg.h': No such file or directory Error executing cl.exe. vorbisfile.dll - 1 error(s), 0 warning(s) <p><p><p>--- >8 ---- List archives: http://www.xiph.org/archives/ Ogg project homepage: http://www.xiph.org...
2009 Oct 28
2
[LLVMdev] windows build
...ning into bunch of windows build issues. Can someone >> please provide help on what might be going wrong >> >> >> llvm\win32\Configure\..\llvm\ADT\hash_set.h >> 1>The system cannot find the file specified. >> >> Similarly >> 2>c1xx : fatal error C1083: Cannot open source file: >> '..\..\lib\Support\Annotation.cpp': No such file or directory > > I guess you are using cmake with Visual Studio. > > Please report version of LLVM used (or svn revision number), version of > Visual Studio, exact cmake command used, exact nm...